{"text_format":"1","workbook":"xlsx","n_sheets":3,"sheets":["Credits","Input-Output","MC Model"],"not_rendered":{"charts":0,"images":11,"macros":1,"external_links":0,"defined_names":23,"comments":1,"pivot_tables":0},"unopened":[],"bounds":{"document_bytes":16777216,"sheet_cells":100000,"rows_first":2000,"rows_last":500,"rows_between":2000,"halvings":0,"cell_chars":16384,"cell_head_chars":4096},"cells_cut":0,"cells_raw":0,"read":"whole","date_system":"1900"}

{"sheet":"Credits","index":0,"n_rows":0,"n_cols":0,"rows_kept":0,"cut":false,"hidden":false,"merged":[]}

{"sheet":"Input-Output","index":1,"n_rows":46,"n_cols":43,"rows_kept":46,"cut":false,"hidden":false,"merged":[[0,1,45,1],[0,44,45,44],[1,6,1,13],[6,5,6,19],[3,5,4,16],[4,18,4,19],[3,18,3,19],[4,26,4,27],[3,26,3,27],[3,39,3,40],[6,26,6,40],[8,21,8,24],[4,39,4,40],[8,3,27,3],[1,33,1,39],[4,22,4,23],[42,23,42,28],[42,15,42,22],[43,15,43,21],[43,24,43,30],[45,15,45,30],[41,15,41,30],[29,15,36,19],[37,15,37,19],[37,5,37,13],[26,21,26,24],[37,26,37,40],[29,5,36,13],[8,42,27,42],[1,26,1,32],[29,26,36,40],[39,15,39,30],[40,15,40,30],[5,22,5,23],[6,22,6,23],[9,21,9,24],[1,21,1,24],[1,14,1,19],[7,22,7,23],[13,21,13,24],[3,21,3,24]]}
[]
[null,null,null,null,null,null,{"$f":"TEXT(NOW(),\"dd/mm/yyyy   hh:mm AM/PM\")","v":"01/12/2011   03:56 PM-DowBoy"},null,null,null,null,null,null,null,"Losing Streak Calculator",null,null,null,null,null,null,"DayTradingLife.com",null,null,null,null,"Monte Carlo \"RAND\" Version",null,null,null,null,null,null,"TraderDowBoy@gmail.com"]
[]
[null,null,null,null,null,{"$f":"\"Probability of 'No' Consecutive Losses in \" & N & \" Trades\"","v":"Probability of 'No' Consecutive Losses in 100 Trades"},null,null,null,null,null,null,null,null,null,null,null,null,"#Trades",null,null,"Tables' Probabilities Legend",null,null,null,null,"#Trials",null,null,null,null,null,null,null,null,null,null,null,null,"RMS Diff"]
[null,null,null,null,null,null,null,null,null,null,null,null,null,null,null,null,null,null,100,null,null,null,"\"ALMOST\" CERTAIN (>99.995%)",null,null,null,100,null,null,null,null,null,null,null,null,null,null,null,null,{"$f":"IF(COUNTBLANK($AA$5)=0,SQRT(AVERAGE((G10:T28-rgnOut)^2)),\"\")","v":2.8173270206766715E-2}]
[null,null,null,null,null,null,null,null,null,null,null,null,null,null,null,null,null,null,null,null,null,null,"HIGH ( >50% & <99.995%)"]
[null,null,null,null,null,"Results of Calculation ",null,null,null,null,null,null,null,null,null,null,null,null,null,null,null,null,"MEDIUM (>0.005% & <50%)",null,null,null,"Results of Monte Carlo \"RAND\" Simulation"]
[null,null,null,null,null,null,null,null,null,null,null,null,null,null,null,null,null,null,null,null,null,null,"VERY UNLIKELY (<0.005%)"]
[null,null,null,"Losing Percentages",null," 'No'   Ploss",2,3,4,5,6,7,8,9,10,11,12,13,14,15,null,"Losing Streak - Quick Calc",null,null,null,null," 'No'   Ploss",{"$f":"G9","v":2},3,4,5,6,7,8,9,10,11,{"$f":"Q9","v":12},{"$f":"R9","v":13},{"$f":"S9","v":14},{"$f":"T9","v":15},null,"Losing Percentages"]
[null,null,null,null,null,0.05,{"$f":"IF(COUNTA(N)=1,ProbRun(N, Run, p),\"\")","v":0.21072642184673132},{"$f":"IF(COUNTA(N)=1,ProbRun(N, Run, p),\"\")","v":1.1580926924185934E-2},{"$f":"IF(COUNTA(N)=1,ProbRun(N, Run, p),\"\")","v":5.7609903689681194E-4},{"$f":"IF(COUNTA(N)=1,ProbRun(N, Run, p),\"\")","v":2.8515263673336922E-5},{"$f":"IF(COUNTA(N)=1,ProbRun(N, Run, p),\"\")","v":1.4109366361404383E-6},{"$f":"IF(COUNTA(N)=1,ProbRun(N, Run, p),\"\")","v":6.9804685436805776E-8},{"$f":"IF(COUNTA(N)=1,ProbRun(N, Run, p),\"\")","v":3.453124995077646E-9},{"$f":"IF(COUNTA(N)=1,ProbRun(N, Run, p),\"\")","v":1.708007812382695E-10},{"$f":"IF(COUNTA(N)=1,ProbRun(N, Run, p),\"\")","v":8.4472656249720791E-12},{"$f":"IF(COUNTA(N)=1,ProbRun(N, Run, p),\"\")","v":4.1772460937493396E-13},{"$f":"IF(COUNTA(N)=1,ProbRun(N, Run, p),\"\")","v":2.0654296874999848E-14},{"$f":"IF(COUNTA(N)=1,ProbRun(N, Run, p),\"\")","v":1.0211181640625006E-15},{"$f":"IF(COUNTA(N)=1,ProbRun(N, Run, p),\"\")","v":5.047607421875005E-17},{"$f":"IF(COUNTA(N)=1,ProbRun(N, Run, p),\"\")","v":2.4948120117187486E-18},null,"\"Enter Yellow Cells Only\"",null,null,null,null,{"$f":"F10","v":0.05},0.31,0.01,0,0,0,0,0,0,0,0,0,0,0,0]
[null,null,null,null,null,0.1,{"$f":"IF(COUNTA(N)=1,ProbRun(N, Run, p),\"\")","v":0.59848855351830876},{"$f":"IF(COUNTA(N)=1,ProbRun(N, Run, p),\"\")","v":8.476518006117921E-2},{"$f":"IF(COUNTA(N)=1,ProbRun(N, Run, p),\"\")","v":8.7053483648354447E-3},{"$f":"IF(COUNTA(N)=1,ProbRun(N, Run, p),\"\")","v":8.6466756988405581E-4},{"$f":"IF(COUNTA(N)=1,ProbRun(N, Run, p),\"\")","v":8.5596820187249374E-5},{"$f":"IF(COUNTA(N)=1,ProbRun(N, Run, p),\"\")","v":8.469969620560146E-6},{"$f":"IF(COUNTA(N)=1,ProbRun(N, Run, p),\"\")","v":8.3799971007405383E-7},{"$f":"IF(COUNTA(N)=1,ProbRun(N, Run, p),\"\")","v":8.2899997236190079E-8},{"$f":"IF(COUNTA(N)=1,ProbRun(N, Run, p),\"\")","v":8.1999999736840055E-9},{"$f":"IF(COUNTA(N)=1,ProbRun(N, Run, p),\"\")","v":8.1099999974973732E-10},{"$f":"IF(COUNTA(N)=1,ProbRun(N, Run, p),\"\")","v":8.0199999997623101E-11},{"$f":"IF(COUNTA(N)=1,ProbRun(N, Run, p),\"\")","v":7.9299999999774645E-12},{"$f":"IF(COUNTA(N)=1,ProbRun(N, Run, p),\"\")","v":7.8399999999978694E-13},{"$f":"IF(COUNTA(N)=1,ProbRun(N, Run, p),\"\")","v":7.7499999999998067E-14},null,null,"# Trades",1000,null,null,0.1,0.63,0.08,0.03,0.01,0,0,0,0,0,0,0,0,0,0]
[null,null,null,null,null,0.15,{"$f":"IF(COUNTA(N)=1,ProbRun(N, Run, p),\"\")","v":0.86375547074544123},{"$f":"IF(COUNTA(N)=1,ProbRun(N, Run, p),\"\")","v":0.24758333602937632},{"$f":"IF(COUNTA(N)=1,ProbRun(N, Run, p),\"\")","v":4.1030124437659722E-2},{"$f":"IF(COUNTA(N)=1,ProbRun(N, Run, p),\"\")","v":6.1907911214123777E-3},{"$f":"IF(COUNTA(N)=1,ProbRun(N, Run, p),\"\")","v":9.2113309804689144E-4},{"$f":"IF(COUNTA(N)=1,ProbRun(N, Run, p),\"\")","v":1.367650074550936E-4},{"$f":"IF(COUNTA(N)=1,ProbRun(N, Run, p),\"\")","v":2.0297923626686071E-5},{"$f":"IF(COUNTA(N)=1,ProbRun(N, Run, p),\"\")","v":3.0120335579374332E-6},{"$f":"IF(COUNTA(N)=1,ProbRun(N, Run, p),\"\")","v":4.4690397455427059E-7},{"$f":"IF(COUNTA(N)=1,ProbRun(N, Run, p),\"\")","v":6.630037698919703E-8},{"$f":"IF(COUNTA(N)=1,ProbRun(N, Run, p),\"\")","v":9.8347723763583446E-9},{"$f":"IF(COUNTA(N)=1,ProbRun(N, Run, p),\"\")","v":1.4586732029723721E-9},{"$f":"IF(COUNTA(N)=1,ProbRun(N, Run, p),\"\")","v":2.1631958183188468E-10},{"$f":"IF(COUNTA(N)=1,ProbRun(N, Run, p),\"\")","v":3.2075727470051951E-11},null,null,"Losing Streak 'No'",5,null,null,0.15,0.86,0.33,0.05,0.02,0,0,0,0,0,0,0,0,0,0]
[null,null,null,null,null,0.2,{"$f":"IF(COUNTA(N)=1,ProbRun(N, Run, p),\"\")","v":0.96862786695703484},{"$f":"IF(COUNTA(N)=1,ProbRun(N, Run, p),\"\")","v":0.47435140015648547},{"$f":"IF(COUNTA(N)=1,ProbRun(N, Run, p),\"\")","v":0.11766799869930249},{"$f":"IF(COUNTA(N)=1,ProbRun(N, Run, p),\"\")","v":2.4371880260629506E-2},{"$f":"IF(COUNTA(N)=1,ProbRun(N, Run, p),\"\")","v":4.8664892033575859E-3},{"$f":"IF(COUNTA(N)=1,ProbRun(N, Run, p),\"\")","v":9.6472556231354744E-4},{"$f":"IF(COUNTA(N)=1,ProbRun(N, Run, p),\"\")","v":1.9096093888879473E-4},{"$f":"IF(COUNTA(N)=1,ProbRun(N, Run, p),\"\")","v":3.7785025636510057E-5},{"$f":"IF(COUNTA(N)=1,ProbRun(N, Run, p),\"\")","v":7.4751781225420927E-6},{"$f":"IF(COUNTA(N)=1,ProbRun(N, Run, p),\"\")","v":1.4786551677160927E-6},{"$f":"IF(COUNTA(N)=1,ProbRun(N, Run, p),\"\")","v":2.92454368378305E-7},{"$f":"IF(COUNTA(N)=1,ProbRun(N, Run, p),\"\")","v":5.7835518800200933E-8},{"$f":"IF(COUNTA(N)=1,ProbRun(N, Run, p),\"\")","v":1.1436031954542077E-8},{"$f":"IF(COUNTA(N)=1,ProbRun(N, Run, p),\"\")","v":2.2609919982802976E-9},null,null,"Loss Probability %",0.45,null,null,0.2,0.99,0.59,0.12,0.03,0,0,0,0,0,0,0,0,0,0]
[null,null,null,null,null,0.25,{"$f":"IF(COUNTA(N)=1,ProbRun(N, Run, p),\"\")","v":0.9950793852734019},{"$f":"IF(COUNTA(N)=1,ProbRun(N, Run, p),\"\")","v":0.69936183838757271},{"$f":"IF(COUNTA(N)=1,ProbRun(N, Run, p),\"\")","v":0.25091638966386387},{"$f":"IF(COUNTA(N)=1,ProbRun(N, Run, p),\"\")","v":6.8384012603348435E-2},{"$f":"IF(COUNTA(N)=1,ProbRun(N, Run, p),\"\")","v":1.7324346396392805E-2},{"$f":"IF(COUNTA(N)=1,ProbRun(N, Run, p),\"\")","v":4.3103460341444924E-3},{"$f":"IF(COUNTA(N)=1,ProbRun(N, Run, p),\"\")","v":1.0676441253021215E-3},{"$f":"IF(COUNTA(N)=1,ProbRun(N, Run, p),\"\")","v":2.6413970835317021E-4},{"$f":"IF(COUNTA(N)=1,ProbRun(N, Run, p),\"\")","v":6.5325019498522089E-5},{"$f":"IF(COUNTA(N)=1,ProbRun(N, Run, p),\"\")","v":1.6152759389889005E-5},{"$f":"IF(COUNTA(N)=1,ProbRun(N, Run, p),\"\")","v":3.9935053020063391E-6},{"$f":"IF(COUNTA(N)=1,ProbRun(N, Run, p),\"\")","v":9.8720157941384141E-7},{"$f":"IF(COUNTA(N)=1,ProbRun(N, Run, p),\"\")","v":2.4400649384706604E-7},{"$f":"IF(COUNTA(N)=1,ProbRun(N, Run, p),\"\")","v":6.0303135482559032E-8},null,{"$f":"IF(OR(COUNTA($X$11,$X$13)<2,$X$12=0,LEFT($X$12,1) =\" \",$X$12=\"\"),\"\",\"Results For Losing Streak Lengths Of (\"&X12&\")\")","v":"Results For Losing Streak Lengths Of (5)"},null,null,null,null,0.25,1,0.7,0.21,0.09,0.01,0,0,0,0,0,0,0,0,0]
[null,null,null,null,null,0.3,{"$f":"IF(COUNTA(N)=1,ProbRun(N, Run, p),\"\")","v":0.99947840298437962},{"$f":"IF(COUNTA(N)=1,ProbRun(N, Run, p),\"\")","v":0.86394792066358039},{"$f":"IF(COUNTA(N)=1,ProbRun(N, Run, p),\"\")","v":0.43263076488130858},{"$f":"IF(COUNTA(N)=1,ProbRun(N, Run, p),\"\")","v":0.15256217840340905},{"$f":"IF(COUNTA(N)=1,ProbRun(N, Run, p),\"\")","v":4.7679934135323926E-2},{"$f":"IF(COUNTA(N)=1,ProbRun(N, Run, p),\"\")","v":1.4367828977774061E-2},{"$f":"IF(COUNTA(N)=1,ProbRun(N, Run, p),\"\")","v":4.283295103347089E-3},{"$f":"IF(COUNTA(N)=1,ProbRun(N, Run, p),\"\")","v":1.2728375890495895E-3},{"$f":"IF(COUNTA(N)=1,ProbRun(N, Run, p),\"\")","v":3.7785766214032976E-4},{"$f":"IF(COUNTA(N)=1,ProbRun(N, Run, p),\"\")","v":1.1212926212800115E-4},{"$f":"IF(COUNTA(N)=1,ProbRun(N, Run, p),\"\")","v":3.3267797164194178E-5},{"$f":"IF(COUNTA(N)=1,ProbRun(N, Run, p),\"\")","v":9.868824412027102E-6},{"$f":"IF(COUNTA(N)=1,ProbRun(N, Run, p),\"\")","v":2.9271740475212167E-6},{"$f":"IF(COUNTA(N)=1,ProbRun(N, Run, p),\"\")","v":8.6810861977009104E-7},null,null,"1 Or More Streaks",{"$f":"IF(OR(COUNTA($X$11,$X$13)<2,$X$12=0,LEFT($X$12,1) =\" \",$X$12=\"\"),\"\",ProbRunMulti(Len,BadRun,PLose,12))","v":0.99997817041624626},null,null,0.3,1,0.9,0.44,0.18,0.06,0.03,0.02,0,0,0,0,0,0,0]
[null,null,null,null,null,0.35,{"$f":"IF(COUNTA(N)=1,ProbRun(N, Run, p),\"\")","v":0.99996334282057608},{"$f":"IF(COUNTA(N)=1,ProbRun(N, Run, p),\"\")","v":0.95290743276105139},{"$f":"IF(COUNTA(N)=1,ProbRun(N, Run, p),\"\")","v":0.63031474127595788},{"$f":"IF(COUNTA(N)=1,ProbRun(N, Run, p),\"\")","v":0.28520839529283815},{"$f":"IF(COUNTA(N)=1,ProbRun(N, Run, p),\"\")","v":0.10865468069812106},{"$f":"IF(COUNTA(N)=1,ProbRun(N, Run, p),\"\")","v":3.8880210354229491E-2},{"$f":"IF(COUNTA(N)=1,ProbRun(N, Run, p),\"\")","v":1.3614180820813133E-2},{"$f":"IF(COUNTA(N)=1,ProbRun(N, Run, p),\"\")","v":4.7317224094149202E-3},{"$f":"IF(COUNTA(N)=1,ProbRun(N, Run, p),\"\")","v":1.6402804869398435E-3},{"$f":"IF(COUNTA(N)=1,ProbRun(N, Run, p),\"\")","v":5.6806880649392711E-4},{"$f":"IF(COUNTA(N)=1,ProbRun(N, Run, p),\"\")","v":1.9665631987678676E-4},{"$f":"IF(COUNTA(N)=1,ProbRun(N, Run, p),\"\")","v":6.8064285494963964E-5},{"$f":"IF(COUNTA(N)=1,ProbRun(N, Run, p),\"\")","v":2.3553818675779169E-5},{"$f":"IF(COUNTA(N)=1,ProbRun(N, Run, p),\"\")","v":8.1497070862710477E-6},null,null,"2 Or More Streaks",0.99972918545150879,null,null,0.35,1,0.97,0.7,0.3,0.14000000000000001,7.0000000000000007E-2,0.02,0,0,0,0,0,0,0]
[null,null,null,null,null,0.4,{"$f":"IF(COUNTA(N)=1,ProbRun(N, Run, p),\"\")","v":0.99999834481206584},{"$f":"IF(COUNTA(N)=1,ProbRun(N, Run, p),\"\")","v":0.98798193700502146},{"$f":"IF(COUNTA(N)=1,ProbRun(N, Run, p),\"\")","v":0.80078752850640522},{"$f":"IF(COUNTA(N)=1,ProbRun(N, Run, p),\"\")","v":0.45907367434131996},{"$f":"IF(COUNTA(N)=1,ProbRun(N, Run, p),\"\")","v":0.21245103449158603},{"$f":"IF(COUNTA(N)=1,ProbRun(N, Run, p),\"\")","v":8.9469490022521997E-2},{"$f":"IF(COUNTA(N)=1,ProbRun(N, Run, p),\"\")","v":3.6275125676135722E-2},{"$f":"IF(COUNTA(N)=1,ProbRun(N, Run, p),\"\")","v":1.4489925767711504E-2},{"$f":"IF(COUNTA(N)=1,ProbRun(N, Run, p),\"\")","v":5.7541468159192279E-3},{"$f":"IF(COUNTA(N)=1,ProbRun(N, Run, p),\"\")","v":2.2797180105953341E-3},{"$f":"IF(COUNTA(N)=1,ProbRun(N, Run, p),\"\")","v":9.0231263813768294E-4},{"$f":"IF(COUNTA(N)=1,ProbRun(N, Run, p),\"\")","v":3.5697336822897917E-4},{"$f":"IF(COUNTA(N)=1,ProbRun(N, Run, p),\"\")","v":1.4119010825604808E-4},{"$f":"IF(COUNTA(N)=1,ProbRun(N, Run, p),\"\")","v":5.5833524083017624E-5},null,null,"3 Or More Streaks",0.9983253602192671,null,null,0.4,1,1,0.85,0.46,0.23,0.11,0.05,0.01,0,0,0,0,0,0]
[null,null,null,null,null,0.45,{"$f":"IF(COUNTA(N)=1,ProbRun(N, Run, p),\"\")","v":0.99999995413362497},{"$f":"IF(COUNTA(N)=1,ProbRun(N, Run, p),\"\")","v":0.997833411658403},{"$f":"IF(COUNTA(N)=1,ProbRun(N, Run, p),\"\")","v":0.91501832028146413},{"$f":"IF(COUNTA(N)=1,ProbRun(N, Run, p),\"\")","v":0.64684083848002849},{"$f":"IF(COUNTA(N)=1,ProbRun(N, Run, p),\"\")","v":0.36285045959889556},{"$f":"IF(COUNTA(N)=1,ProbRun(N, Run, p),\"\")","v":0.1794854230141586},{"$f":"IF(COUNTA(N)=1,ProbRun(N, Run, p),\"\")","v":8.3712842105834032E-2},{"$f":"IF(COUNTA(N)=1,ProbRun(N, Run, p),\"\")","v":3.8032329608620373E-2},{"$f":"IF(COUNTA(N)=1,ProbRun(N, Run, p),\"\")","v":1.7080022387218122E-2},{"$f":"IF(COUNTA(N)=1,ProbRun(N, Run, p),\"\")","v":7.6314256452682449E-3},{"$f":"IF(COUNTA(N)=1,ProbRun(N, Run, p),\"\")","v":3.401959468700057E-3},{"$f":"IF(COUNTA(N)=1,ProbRun(N, Run, p),\"\")","v":1.514923220727027E-3},{"$f":"IF(COUNTA(N)=1,ProbRun(N, Run, p),\"\")","v":6.742489467804325E-4},{"$f":"IF(COUNTA(N)=1,ProbRun(N, Run, p),\"\")","v":2.9999715306670892E-4},null,null,"4 Or More Streaks",0.993109066515659,null,null,0.45,1,1,0.97,0.61,0.38,0.2,0.08,0.02,0,0,0,0,0,0]
[null,null,null,null,null,0.5,{"$f":"IF(COUNTA(N)=1,ProbRun(N, Run, p),\"\")","v":0.99999999926843197},{"$f":"IF(COUNTA(N)=1,ProbRun(N, Run, p),\"\")","v":0.99973825542001715},{"$f":"IF(COUNTA(N)=1,ProbRun(N, Run, p),\"\")","v":0.97271504229883976},{"$f":"IF(COUNTA(N)=1,ProbRun(N, Run, p),\"\")","v":0.81010959919635794},{"$f":"IF(COUNTA(N)=1,ProbRun(N, Run, p),\"\")","v":0.54609361924994537},{"$f":"IF(COUNTA(N)=1,ProbRun(N, Run, p),\"\")","v":0.31752038749660583},{"$f":"IF(COUNTA(N)=1,ProbRun(N, Run, p),\"\")","v":0.17020796241907779},{"$f":"IF(COUNTA(N)=1,ProbRun(N, Run, p),\"\")","v":8.7558927105253218E-2},{"$f":"IF(COUNTA(N)=1,ProbRun(N, Run, p),\"\")","v":4.4137228640421695E-2},{"$f":"IF(COUNTA(N)=1,ProbRun(N, Run, p),\"\")","v":2.2029265759701801E-2},{"$f":"IF(COUNTA(N)=1,ProbRun(N, Run, p),\"\")","v":1.0941677889731247E-2},{"$f":"IF(COUNTA(N)=1,ProbRun(N, Run, p),\"\")","v":5.4215245663758781E-3},{"$f":"IF(COUNTA(N)=1,ProbRun(N, Run, p),\"\")","v":2.6830332748502606E-3},{"$f":"IF(COUNTA(N)=1,ProbRun(N, Run, p),\"\")","v":1.3269198698939429E-3},null,null,"5 Or More Streaks",0.97873994971606115,null,null,0.5,1,1,0.99,0.86,0.61,0.37,0.18,0.08,0.06,0.02,0,0,0,0]
[null,null,null,null,null,0.55000000000000004,{"$f":"IF(COUNTA(N)=1,ProbRun(N, Run, p),\"\")","v":0.99999999999385425},{"$f":"IF(COUNTA(N)=1,ProbRun(N, Run, p),\"\")","v":0.99998020309455105},{"$f":"IF(COUNTA(N)=1,ProbRun(N, Run, p),\"\")","v":0.99379794220182449},{"$f":"IF(COUNTA(N)=1,ProbRun(N, Run, p),\"\")","v":0.92049912743003892},{"$f":"IF(COUNTA(N)=1,ProbRun(N, Run, p),\"\")","v":0.72897121177165625},{"$f":"IF(COUNTA(N)=1,ProbRun(N, Run, p),\"\")","v":0.49705748409212008},{"$f":"IF(COUNTA(N)=1,ProbRun(N, Run, p),\"\")","v":0.30680532180682812},{"$f":"IF(COUNTA(N)=1,ProbRun(N, Run, p),\"\")","v":0.1787414350595003},{"$f":"IF(COUNTA(N)=1,ProbRun(N, Run, p),\"\")","v":0.10086908739214807},{"$f":"IF(COUNTA(N)=1,ProbRun(N, Run, p),\"\")","v":5.5952330063900942E-2},{"$f":"IF(COUNTA(N)=1,ProbRun(N, Run, p),\"\")","v":3.075142965099267E-2},{"$f":"IF(COUNTA(N)=1,ProbRun(N, Run, p),\"\")","v":1.6817229145816518E-2},{"$f":"IF(COUNTA(N)=1,ProbRun(N, Run, p),\"\")","v":9.1721942841640498E-3},{"$f":"IF(COUNTA(N)=1,ProbRun(N, Run, p),\"\")","v":4.9951165792183868E-3},null,null,"6 Or More Streaks",0.94744295067201201,null,null,0.55000000000000004,1,1,1,0.97,0.73,0.5,0.28999999999999998,0.11,0.08,0.05,0.02,0.02,0.01,0]
[null,null,null,null,null,0.6,{"$f":"IF(COUNTA(N)=1,ProbRun(N, Run, p),\"\")","v":0.9999999999999758},{"$f":"IF(COUNTA(N)=1,ProbRun(N, Run, p),\"\")","v":0.99999914435260318},{"$f":"IF(COUNTA(N)=1,ProbRun(N, Run, p),\"\")","v":0.99907685595136908},{"$f":"IF(COUNTA(N)=1,ProbRun(N, Run, p),\"\")","v":0.97583971711148654},{"$f":"IF(COUNTA(N)=1,ProbRun(N, Run, p),\"\")","v":0.87262306564791536},{"$f":"IF(COUNTA(N)=1,ProbRun(N, Run, p),\"\")","v":0.68909848906127014},{"$f":"IF(COUNTA(N)=1,ProbRun(N, Run, p),\"\")","v":0.48971982039664969},{"$f":"IF(COUNTA(N)=1,ProbRun(N, Run, p),\"\")","v":0.32392345271879941},{"$f":"IF(COUNTA(N)=1,ProbRun(N, Run, p),\"\")","v":0.20490987499817193},{"$f":"IF(COUNTA(N)=1,ProbRun(N, Run, p),\"\")","v":0.12621027355802325},{"$f":"IF(COUNTA(N)=1,ProbRun(N, Run, p),\"\")","v":7.6525415353762144E-2},{"$f":"IF(COUNTA(N)=1,ProbRun(N, Run, p),\"\")","v":4.5975372717235251E-2},{"$f":"IF(COUNTA(N)=1,ProbRun(N, Run, p),\"\")","v":2.7473164174622384E-2},{"$f":"IF(COUNTA(N)=1,ProbRun(N, Run, p),\"\")","v":1.6365060508966505E-2},null,null,"7 Or More Streaks",0.89130393057761648,null,null,0.6,1,1,1,1,0.87,0.71,0.5,0.27,0.2,0.11,0.06,0.06,0.02,0]
[null,null,null,null,null,0.65,{"$f":"IF(COUNTA(N)=1,ProbRun(N, Run, p),\"\")","v":0.99999999999999989},{"$f":"IF(COUNTA(N)=1,ProbRun(N, Run, p),\"\")","v":0.99999998139460555},{"$f":"IF(COUNTA(N)=1,ProbRun(N, Run, p),\"\")","v":0.99991899187560207},{"$f":"IF(COUNTA(N)=1,ProbRun(N, Run, p),\"\")","v":0.99513929636357623},{"$f":"IF(COUNTA(N)=1,ProbRun(N, Run, p),\"\")","v":0.95660951029249885},{"$f":"IF(COUNTA(N)=1,ProbRun(N, Run, p),\"\")","v":0.85019959094679898},{"$f":"IF(COUNTA(N)=1,ProbRun(N, Run, p),\"\")","v":0.68959051197979937},{"$f":"IF(COUNTA(N)=1,ProbRun(N, Run, p),\"\")","v":0.51811208332515069},{"$f":"IF(COUNTA(N)=1,ProbRun(N, Run, p),\"\")","v":0.36847060791397351},{"$f":"IF(COUNTA(N)=1,ProbRun(N, Run, p),\"\")","v":0.25259623972010387},{"$f":"IF(COUNTA(N)=1,ProbRun(N, Run, p),\"\")","v":0.16909165591664124},{"$f":"IF(COUNTA(N)=1,ProbRun(N, Run, p),\"\")","v":0.11148891498392251},{"$f":"IF(COUNTA(N)=1,ProbRun(N, Run, p),\"\")","v":7.2806262850036704E-2},{"$f":"IF(COUNTA(N)=1,ProbRun(N, Run, p),\"\")","v":4.7256963724591955E-2},null,null,"8 Or More Streaks",0.80601230009963265,null,null,0.65,1,1,1,1,0.97,0.87,0.7,0.51,0.32,0.2,0.13,0.09,0.05,0.02]
[null,null,null,null,null,0.7,{"$f":"IF(COUNTA(N)=1,ProbRun(N, Run, p),\"\")","v":0.99999999999999989},{"$f":"IF(COUNTA(N)=1,ProbRun(N, Run, p),\"\")","v":0.9999999998310124},{"$f":"IF(COUNTA(N)=1,ProbRun(N, Run, p),\"\")","v":0.99999639101800519},{"$f":"IF(COUNTA(N)=1,ProbRun(N, Run, p),\"\")","v":0.99943048347639374},{"$f":"IF(COUNTA(N)=1,ProbRun(N, Run, p),\"\")","v":0.99043599116952263},{"$f":"IF(COUNTA(N)=1,ProbRun(N, Run, p),\"\")","v":0.94918179841566908},{"$f":"IF(COUNTA(N)=1,ProbRun(N, Run, p),\"\")","v":0.85753502814118199},{"$f":"IF(COUNTA(N)=1,ProbRun(N, Run, p),\"\")","v":0.72565083334078984},{"$f":"IF(COUNTA(N)=1,ProbRun(N, Run, p),\"\")","v":0.58008384781513811},{"$f":"IF(COUNTA(N)=1,ProbRun(N, Run, p),\"\")","v":0.44388104580937859},{"$f":"IF(COUNTA(N)=1,ProbRun(N, Run, p),\"\")","v":0.32910556576221983},{"$f":"IF(COUNTA(N)=1,ProbRun(N, Run, p),\"\")","v":0.23868090312202506},{"$f":"IF(COUNTA(N)=1,ProbRun(N, Run, p),\"\")","v":0.17049192842437211},{"$f":"IF(COUNTA(N)=1,ProbRun(N, Run, p),\"\")","v":0.12052771650453589},null,null,"9 Or More Streaks",0.69398158296742807,null,null,0.7,1,1,1,1,0.99,0.93,0.81,0.69,0.55000000000000004,0.42,0.28999999999999998,0.21,0.17,0.12]
[null,null,null,null,null,0.75,{"$f":"IF(COUNTA(N)=1,ProbRun(N, Run, p),\"\")","v":1},{"$f":"IF(COUNTA(N)=1,ProbRun(N, Run, p),\"\")","v":0.99999999999951905},{"$f":"IF(COUNTA(N)=1,ProbRun(N, Run, p),\"\")","v":0.99999993496305617},{"$f":"IF(COUNTA(N)=1,ProbRun(N, Run, p),\"\")","v":0.99996790408344582},{"$f":"IF(COUNTA(N)=1,ProbRun(N, Run, p),\"\")","v":0.99884586804555042},{"$f":"IF(COUNTA(N)=1,ProbRun(N, Run, p),\"\")","v":0.98954318734732827},{"$f":"IF(COUNTA(N)=1,ProbRun(N, Run, p),\"\")","v":0.95686838351624492},{"$f":"IF(COUNTA(N)=1,ProbRun(N, Run, p),\"\")","v":0.88948928495441204},{"$f":"IF(COUNTA(N)=1,ProbRun(N, Run, p),\"\")","v":0.79042541916068743},{"$f":"IF(COUNTA(N)=1,ProbRun(N, Run, p),\"\")","v":0.67347979310392214},{"$f":"IF(COUNTA(N)=1,ProbRun(N, Run, p),\"\")","v":0.55407790976447424},{"$f":"IF(COUNTA(N)=1,ProbRun(N, Run, p),\"\")","v":0.44350685411690827},{"$f":"IF(COUNTA(N)=1,ProbRun(N, Run, p),\"\")","v":0.34770974555615258},{"$f":"IF(COUNTA(N)=1,ProbRun(N, Run, p),\"\")","v":0.26844058445075225},null,null,"10 Or More Streaks",0.56475541574699295,null,null,0.75,1,1,1,1,1,0.97,0.93,0.84,0.73,0.61,0.5,0.39,0.3,0.22]
[null,null,null,null,null,0.8,{"$f":"IF(COUNTA(N)=1,ProbRun(N, Run, p),\"\")","v":1},{"$f":"IF(COUNTA(N)=1,ProbRun(N, Run, p),\"\")","v":0.99999999999999967},{"$f":"IF(COUNTA(N)=1,ProbRun(N, Run, p),\"\")","v":0.99999999967407427},{"$f":"IF(COUNTA(N)=1,ProbRun(N, Run, p),\"\")","v":0.99999936283269997},{"$f":"IF(COUNTA(N)=1,ProbRun(N, Run, p),\"\")","v":0.99994172271860893},{"$f":"IF(COUNTA(N)=1,ProbRun(N, Run, p),\"\")","v":0.99897103788489927},{"$f":"IF(COUNTA(N)=1,ProbRun(N, Run, p),\"\")","v":0.99304311893567654},{"$f":"IF(COUNTA(N)=1,ProbRun(N, Run, p),\"\")","v":0.97405349089604654},{"$f":"IF(COUNTA(N)=1,ProbRun(N, Run, p),\"\")","v":0.93420278400409129},{"$f":"IF(COUNTA(N)=1,ProbRun(N, Run, p),\"\")","v":0.87123769560218811},{"$f":"IF(COUNTA(N)=1,ProbRun(N, Run, p),\"\")","v":0.78932598681455657},{"$f":"IF(COUNTA(N)=1,ProbRun(N, Run, p),\"\")","v":0.69627710510557894},{"$f":"IF(COUNTA(N)=1,ProbRun(N, Run, p),\"\")","v":0.60025990985454369},{"$f":"IF(COUNTA(N)=1,ProbRun(N, Run, p),\"\")","v":0.50778811924096501},null,null,"11 Or More Streaks",0.43223130676723914,null,null,0.8,1,1,1,1,1,1,0.98,0.96,0.91,0.85,0.69,0.59,0.51,0.43]
[null,null,null,null,null,0.85,{"$f":"IF(COUNTA(N)=1,ProbRun(N, Run, p),\"\")","v":0.99999999999999989},{"$f":"IF(COUNTA(N)=1,ProbRun(N, Run, p),\"\")","v":0.99999999999999989},{"$f":"IF(COUNTA(N)=1,ProbRun(N, Run, p),\"\")","v":0.99999999999977274},{"$f":"IF(COUNTA(N)=1,ProbRun(N, Run, p),\"\")","v":0.99999999748192836},{"$f":"IF(COUNTA(N)=1,ProbRun(N, Run, p),\"\")","v":0.999999244172604},{"$f":"IF(COUNTA(N)=1,ProbRun(N, Run, p),\"\")","v":0.99996844025353193},{"$f":"IF(COUNTA(N)=1,ProbRun(N, Run, p),\"\")","v":0.99959208327328575},{"$f":"IF(COUNTA(N)=1,ProbRun(N, Run, p),\"\")","v":0.99748715249945541},{"$f":"IF(COUNTA(N)=1,ProbRun(N, Run, p),\"\")","v":0.99052278138775085},{"$f":"IF(COUNTA(N)=1,ProbRun(N, Run, p),\"\")","v":0.97448051949019598},{"$f":"IF(COUNTA(N)=1,ProbRun(N, Run, p),\"\")","v":0.94585215779688114},{"$f":"IF(COUNTA(N)=1,ProbRun(N, Run, p),\"\")","v":0.90332348048254063},{"$f":"IF(COUNTA(N)=1,ProbRun(N, Run, p),\"\")","v":0.8480687805857603},{"$f":"IF(COUNTA(N)=1,ProbRun(N, Run, p),\"\")","v":0.78307164866432022},null,null,"12 Or More Streaks",0.31019532934031729,null,null,0.85,1,1,1,1,1,1,0.98,0.98,0.98,0.96,0.88,0.79,0.72,0.65]
[null,null,null,null,null,0.9,{"$f":"IF(COUNTA(N)=1,ProbRun(N, Run, p),\"\")","v":1},{"$f":"IF(COUNTA(N)=1,ProbRun(N, Run, p),\"\")","v":0.99999999999999989},{"$f":"IF(COUNTA(N)=1,ProbRun(N, Run, p),\"\")","v":0.99999999999999989},{"$f":"IF(COUNTA(N)=1,ProbRun(N, Run, p),\"\")","v":0.99999999999943467},{"$f":"IF(COUNTA(N)=1,ProbRun(N, Run, p),\"\")","v":0.99999999913259774},{"$f":"IF(COUNTA(N)=1,ProbRun(N, Run, p),\"\")","v":0.99999988078859692},{"$f":"IF(COUNTA(N)=1,ProbRun(N, Run, p),\"\")","v":0.99999618640041466},{"$f":"IF(COUNTA(N)=1,ProbRun(N, Run, p),\"\")","v":0.99995218948200926},{"$f":"IF(COUNTA(N)=1,ProbRun(N, Run, p),\"\")","v":0.99968108355884666},{"$f":"IF(COUNTA(N)=1,ProbRun(N, Run, p),\"\")","v":0.99863146281226967},{"$f":"IF(COUNTA(N)=1,ProbRun(N, Run, p),\"\")","v":0.99572614088807676},{"$f":"IF(COUNTA(N)=1,ProbRun(N, Run, p),\"\")","v":0.9894451625548476},{"$f":"IF(COUNTA(N)=1,ProbRun(N, Run, p),\"\")","v":0.97816190750108734},{"$f":"IF(COUNTA(N)=1,ProbRun(N, Run, p),\"\")","v":0.96055662127850039},null,{"$f":"IF(OR(COUNTA($X$11,$X$13)<2,$X$12=0,LEFT($X$12,1) =\" \",$X$12=\"\"),\"\",\"RESULTS:- ARE All LOSING STREAKS\")","v":"RESULTS:- ARE All LOSING STREAKS"},null,null,null,null,0.9,1,1,1,1,1,1,1,1,1,1,1,0.96,0.94,0.9]
[null,null,null,null,null,0.95,{"$f":"IF(COUNTA(N)=1,ProbRun(N, Run, p),\"\")","v":1},{"$f":"IF(COUNTA(N)=1,ProbRun(N, Run, p),\"\")","v":0.99999999999999989},{"$f":"IF(COUNTA(N)=1,ProbRun(N, Run, p),\"\")","v":1},{"$f":"IF(COUNTA(N)=1,ProbRun(N, Run, p),\"\")","v":0.99999999999999989},{"$f":"IF(COUNTA(N)=1,ProbRun(N, Run, p),\"\")","v":0.99999999999999689},{"$f":"IF(COUNTA(N)=1,ProbRun(N, Run, p),\"\")","v":0.99999999999683176},{"$f":"IF(COUNTA(N)=1,ProbRun(N, Run, p),\"\")","v":0.99999999954654395},{"$f":"IF(COUNTA(N)=1,ProbRun(N, Run, p),\"\")","v":0.99999998145004709},{"$f":"IF(COUNTA(N)=1,ProbRun(N, Run, p),\"\")","v":0.99999967789260213},{"$f":"IF(COUNTA(N)=1,ProbRun(N, Run, p),\"\")","v":0.99999695661948285},{"$f":"IF(COUNTA(N)=1,ProbRun(N, Run, p),\"\")","v":0.99998158214287947},{"$f":"IF(COUNTA(N)=1,ProbRun(N, Run, p),\"\")","v":0.99992021749704973},{"$f":"IF(COUNTA(N)=1,ProbRun(N, Run, p),\"\")","v":0.9997325413300292},{"$f":"IF(COUNTA(N)=1,ProbRun(N, Run, p),\"\")","v":0.99926594948010172},null,null,null,null,null,null,0.95,1,1,1,1,1,1,1,1,1,1,1,1,1,1]
[]
[null,null,null,null,null,"\"As humans we do not come equipped to deal with the variety of randomness that is around us every day. Many professions deal with making processes & things work reliably. We are taught to strive for perfection, for high scores in school & in sports. This can be a handicap to traders. There is no perfection in trading. Instead traders must put probability in their favor.\" ",null,null,null,null,null,null,null,null,null,"\"We Just Trade People's Belief's About The Market. A Game Of Chance? Certainly A Game Of Probability; Probably!\"",null,null,null,null,null,null,null,null,null,null,"\"There is a random distribution between wins & losses for any given set of variables that defines an edge. In other words, based on the past performance of your edge, you may know that out of the next 20 trades, 12 will be winners and 8 will be losers. What you don't know is the sequence of wins & losses or how much money the market is going to make available on the winning trades. This truth makes trading a probability or numbers game. When you really believe that trading is simply a probability game, concepts like “right”& “wrong“ or “win“ & “lose“ no longer have the same significance. As a result, your expectations will be in harmony with the possibilities.\n"]
[]
[]
[]
[]
[]
[]
[]
[null,null,null,null,null,"Trader: Larry Sanders",null,null,null,null,null,null,null,null,null,"Trader: Dow-Boy",null,null,null,null,null,null,null,null,null,null," Trading Coach: Mark Douglas; Taken From His Book:-'Trading In The Zone.'"]
[]
[null,null,null,null,null,null,null,null,null,null,null,null,null,null,null,"Distribution & Reprint Policy."]
[null,null,null,null,null,null,null,null,null,null,null,null,null,null,null,"This document maybe be republished & distributed under the proviso that it cannot be altered or amended."]
[null,null,null,null,null,null,null,null,null,null,null,null,null,null,null,"DayTradingLife.com Reserve all rights to this effect. "]
[null,null,null,null,null,null,null,null,null,null,null,null,null,null,null,"For any futher information please email me at: ",null,null,null,null,null,null,null,"TraderDowBoy@gmail.com"]
[null,null,null,null,null,null,null,null,null,null,null,null,null,null,null,"Copyright © 2011-2012  ",null,null,null,null,null,null," - - - DayTradingLife.com - - - ",null,"All rights reserved."]
[]
[null,null,null,null,null,null,null,null,null,null,null,null,null,null,null,"\"I Wish You Well In Your Journey & In Your Trading.\" - Dow-Boy"]

{"sheet":"MC Model","index":2,"n_rows":119,"n_cols":34,"rows_kept":119,"cut":false,"hidden":false,"merged":[[23,33,23,39],[29,24,32,30],[33,23,33,31],[33,33,33,39],[1,3,1,21],[2,33,13,39],[14,33,15,39],[18,23,18,31],[18,33,22,39]]}
[]
[null,null,null,"Max Run Of Consecutive Losses In The Trial Below"]
[null,null,"Consec Losses",{"$f":"MAX(FREQUENCY(IF(rgnTrial=\"L\", ROW(rgnTrial)), IF(rgnTrial=\"W\", ROW(rgnTrial))))","v":1},{"$f":"MAX(FREQUENCY(IF(rgnTrial=\"L\", ROW(rgnTrial)), IF(rgnTrial=\"W\", ROW(rgnTrial))))","v":2},{"$f":"MAX(FREQUENCY(IF(rgnTrial=\"L\", ROW(rgnTrial)), IF(rgnTrial=\"W\", ROW(rgnTrial))))","v":4},{"$f":"MAX(FREQUENCY(IF(rgnTrial=\"L\", ROW(rgnTrial)), IF(rgnTrial=\"W\", ROW(rgnTrial))))","v":4},{"$f":"MAX(FREQUENCY(IF(rgnTrial=\"L\", ROW(rgnTrial)), IF(rgnTrial=\"W\", ROW(rgnTrial))))","v":6},{"$f":"MAX(FREQUENCY(IF(rgnTrial=\"L\", ROW(rgnTrial)), IF(rgnTrial=\"W\", ROW(rgnTrial))))","v":6},{"$f":"MAX(FREQUENCY(IF(rgnTrial=\"L\", ROW(rgnTrial)), IF(rgnTrial=\"W\", ROW(rgnTrial))))","v":6},{"$f":"MAX(FREQUENCY(IF(rgnTrial=\"L\", ROW(rgnTrial)), IF(rgnTrial=\"W\", ROW(rgnTrial))))","v":6},{"$f":"MAX(FREQUENCY(IF(rgnTrial=\"L\", ROW(rgnTrial)), IF(rgnTrial=\"W\", ROW(rgnTrial))))","v":6},{"$f":"MAX(FREQUENCY(IF(rgnTrial=\"L\", ROW(rgnTrial)), IF(rgnTrial=\"W\", ROW(rgnTrial))))","v":7},{"$f":"MAX(FREQUENCY(IF(rgnTrial=\"L\", ROW(rgnTrial)), IF(rgnTrial=\"W\", ROW(rgnTrial))))","v":8},{"$f":"MAX(FREQUENCY(IF(rgnTrial=\"L\", ROW(rgnTrial)), IF(rgnTrial=\"W\", ROW(rgnTrial))))","v":8},{"$f":"MAX(FREQUENCY(IF(rgnTrial=\"L\", ROW(rgnTrial)), IF(rgnTrial=\"W\", ROW(rgnTrial))))","v":12},{"$f":"MAX(FREQUENCY(IF(rgnTrial=\"L\", ROW(rgnTrial)), IF(rgnTrial=\"W\", ROW(rgnTrial))))","v":18},{"$f":"MAX(FREQUENCY(IF(rgnTrial=\"L\", ROW(rgnTrial)), IF(rgnTrial=\"W\", ROW(rgnTrial))))","v":18},{"$f":"MAX(FREQUENCY(IF(rgnTrial=\"L\", ROW(rgnTrial)), IF(rgnTrial=\"W\", ROW(rgnTrial))))","v":30},{"$f":"MAX(FREQUENCY(IF(rgnTrial=\"L\", ROW(rgnTrial)), IF(rgnTrial=\"W\", ROW(rgnTrial))))","v":30},{"$f":"MAX(FREQUENCY(IF(rgnTrial=\"L\", ROW(rgnTrial)), IF(rgnTrial=\"W\", ROW(rgnTrial))))","v":35},{"$f":"MAX(FREQUENCY(IF(rgnTrial=\"L\", ROW(rgnTrial)), IF(rgnTrial=\"W\", ROW(rgnTrial))))","v":92},null,null,null,null,null,null,null,null,null,null,null,"\"Any of the best traders (the probability thinkers) could have just as much negative energy surrounding what it means to be wrong as the typical trader. But as long as they legitimately define trading as a probability game, their emotional responses to the outcome of any particular trade are equivalent to how the typical trader would feel about flipping a coin, calling heads, and seeing the coin come up tails.\""]
[null,null,{"$f":"TRANSPOSE('Input-Output'!G9:T9)","v":2},{"$f":"--(D$3>=$C4)","v":0},1,1,1,1,1,1,1,1,1,{"$f":"--(N$3>=$C4)","v":1},1,1,1,1,1,1,1,1]
[null,null,3,0,0,1,1,1,1,1,1,1,1,1,1,1,1,1,1,1,1,1]
[null,null,4,0,0,1,1,1,1,1,1,1,1,1,1,1,1,1,1,1,1,1]
[null,null,5,0,0,0,0,1,1,1,1,1,1,1,1,1,1,1,1,1,1,1]
[null,null,6,0,0,0,0,1,1,1,1,1,1,1,1,1,1,1,1,1,1,1]
[null,null,7,0,0,0,0,0,0,0,0,0,1,1,1,1,1,1,1,1,1,1]
[null,null,8,0,0,0,0,0,0,0,0,0,0,1,1,1,1,1,1,1,1,1]
[null,null,9,0,0,0,0,0,0,0,0,0,0,0,0,1,1,1,1,1,1,1]
[null,null,10,0,0,0,0,0,0,0,0,0,0,0,0,1,1,1,1,1,1,1]
[null,null,11,0,0,0,0,0,0,0,0,0,0,0,0,1,1,1,1,1,1,1]
[null,null,12,0,0,0,0,0,0,0,0,0,0,0,0,1,1,1,1,1,1,1]
[null,null,13,0,0,0,0,0,0,0,0,0,0,0,0,0,1,1,1,1,1,1,null,null,null,null,null,null,null,null,null,null,null," Trading Coach:- Mark Douglas."]
[null,null,14,0,0,0,0,0,0,0,0,0,0,0,0,0,1,1,1,1,1,1]
[null,null,15,0,0,0,0,0,0,0,0,0,0,0,0,0,1,1,1,1,1,1]
[]
[null,"Trade","RAND()",{"$f":"TRANSPOSE('Input-Output'!F10:F28)","v":0.05},0.1,0.15,0.2,0.25,0.3,0.35,0.4,0.45,0.5,0.55000000000000004,0.6,0.65,0.7,0.75,0.8,0.85,0.9,0.95,null,"PROBABILITY",null,null,null,null,null,null,null,null,null,"\"It is a truth very certain that when it is not in our power to determine what is true we ought to follow what is most probable. \""]
[null,1,{"$f":"RAND()","v":0.48535962033537938},{"$f":"IF($C20>=D$19, \"W\", \"L\")","v":"W"},"W","W","W","W","W","W","W","W","L",{"$f":"IF($C20>=N$19, \"W\", \"L\")","v":"L"},"L","L","L","L","L","L","L","L"]
[null,2,0.98528852282285273,"W","W","W","W","W","W","W","W","W","W","W","W","W","W","W","W","W","W","W"]
[null,3,0.87206356044068045,"W","W","W","W","W","W","W","W","W","W","W","W","W","W","W","W","W","L","L"]
[null,4,0.93817440761879423,"W","W","W","W","W","W","W","W","W","W","W","W","W","W","W","W","W","W","L"]
[null,5,0.77193793028274094,"W","W","W","W","W","W","W","W","W","W","W","W","W","W","W","L","L","L","L",null,null,null,null,null,null,null,null,null,null,null,"Discourse on Method:- Descartes."]
[null,6,0.98348991588018098,"W","W","W","W","W","W","W","W","W","W","W","W","W","W","W","W","W","W","W"]
[null,7,0.56808799027839518,"W","W","W","W","W","W","W","W","W","W","W","L","L","L","L","L","L","L","L"]
[null,8,0.97152390985473092,"W","W","W","W","W","W","W","W","W","W","W","W","W","W","W","W","W","W","W"]
[null,9,0.35339868367059113,"W","W","W","W","W","W","W","L","L","L","L","L","L","L","L","L","L","L","L"]
[null,10,0.20924429642822029,"W","W","W","W","L","L","L","L","L","L","L","L","L","L","L","L","L","L","L"]
[null,11,0.64738499036021335,{"$f":"IF($C30>=D$19, \"W\", \"L\")","v":"W"},"W","W","W","W","W","W","W","W","W",{"$f":"IF($C30>=N$19, \"W\", \"L\")","v":"W"},"W","L","L","L","L","L","L","L",null,null,"\"The Odds That A Piece Of toast Will Land Butter Side Down, Is Directly Proportional To How Expensive The Carpet Is.\""]
[null,12,0.78544739911374584,"W","W","W","W","W","W","W","W","W","W","W","W","W","W","W","L","L","L","L"]
[null,13,0.40615225877610139,"W","W","W","W","W","W","W","W","L","L","L","L","L","L","L","L","L","L","L"]
[null,14,0.26050166475206182,"W","W","W","W","W","L","L","L","L","L","L","L","L","L","L","L","L","L","L"]
[null,15,0.69794358878583118,"W","W","W","W","W","W","W","W","W","W","W","W","W","L","L","L","L","L","L",null,"Even A Trader Needs A Sense Of Humour! ",null,null,null,null,null,null,null,null,null,"René Descartes - (31st March 1596 - 11th February 1650) "]
[null,16,0.21944344581282926,"W","W","W","W","L","L","L","L","L","L","L","L","L","L","L","L","L","L","L"]
[null,17,0.40064315842417642,"W","W","W","W","W","W","W","W","L","L","L","L","L","L","L","L","L","L","L"]
[null,18,0.47410217836424218,"W","W","W","W","W","W","W","W","W","L","L","L","L","L","L","L","L","L","L"]
[null,19,0.82757522243128412,"W","W","W","W","W","W","W","W","W","W","W","W","W","W","W","W","L","L","L"]
[null,20,0.14463749018418492,"W","W","L","L","L","L","L","L","L","L","L","L","L","L","L","L","L","L","L"]
[null,21,0.87500530065444793,{"$f":"IF($C40>=D$19, \"W\", \"L\")","v":"W"},"W","W","W","W","W","W","W","W","W",{"$f":"IF($C40>=N$19, \"W\", \"L\")","v":"W"},"W","W","W","W","W","W","L","L"]
[null,22,0.20267336017984516,"W","W","W","W","L","L","L","L","L","L","L","L","L","L","L","L","L","L","L"]
[null,23,0.25126321153210029,"W","W","W","W","W","L","L","L","L","L","L","L","L","L","L","L","L","L","L"]
[null,24,0.20738072536222263,"W","W","W","W","L","L","L","L","L","L","L","L","L","L","L","L","L","L","L"]
[null,25,0.46713970020810303,"W","W","W","W","W","W","W","W","W","L","L","L","L","L","L","L","L","L","L"]
[null,26,0.2736914912525964,"W","W","W","W","W","L","L","L","L","L","L","L","L","L","L","L","L","L","L"]
[null,27,0.30447072184199553,"W","W","W","W","W","W","L","L","L","L","L","L","L","L","L","L","L","L","L"]
[null,28,0.39880731687821425,"W","W","W","W","W","W","W","L","L","L","L","L","L","L","L","L","L","L","L"]
[null,29,0.82766169805985079,"W","W","W","W","W","W","W","W","W","W","W","W","W","W","W","W","L","L","L"]
[null,30,0.28141376982821142,"W","W","W","W","W","L","L","L","L","L","L","L","L","L","L","L","L","L","L"]
[null,31,1.3204387092478398E-2,{"$f":"IF($C50>=D$19, \"W\", \"L\")","v":"L"},"L","L","L","L","L","L","L","L","L",{"$f":"IF($C50>=N$19, \"W\", \"L\")","v":"L"},"L","L","L","L","L","L","L","L"]
[null,32,0.19054035182228479,"W","W","W","L","L","L","L","L","L","L","L","L","L","L","L","L","L","L","L"]
[null,33,{"$f":"RAND()","v":0.88289792893551566},"W","W","W","W","W","W","W","W","W","W","W","W","W","W","W","W","W","L","L"]
[null,34,0.48101127317501768,"W","W","W","W","W","W","W","W","W","L","L","L","L","L","L","L","L","L","L"]
[null,35,0.42644865299928769,"W","W","W","W","W","W","W","W","L","L","L","L","L","L","L","L","L","L","L"]
[null,36,0.745777817240173,"W","W","W","W","W","W","W","W","W","W","W","W","W","W","L","L","L","L","L"]
[null,37,0.71871562915683507,"W","W","W","W","W","W","W","W","W","W","W","W","W","W","L","L","L","L","L"]
[null,38,0.66916320659633965,"W","W","W","W","W","W","W","W","W","W","W","W","W","L","L","L","L","L","L"]
[null,39,0.60296273188214178,"W","W","W","W","W","W","W","W","W","W","W","W","L","L","L","L","L","L","L"]
[null,40,0.30537431642713131,"W","W","W","W","W","W","L","L","L","L","L","L","L","L","L","L","L","L","L"]
[null,41,0.58232004258750236,{"$f":"IF($C60>=D$19, \"W\", \"L\")","v":"W"},"W","W","W","W","W","W","W","W","W",{"$f":"IF($C60>=N$19, \"W\", \"L\")","v":"W"},"L","L","L","L","L","L","L","L"]
[null,42,0.57733064582075244,"W","W","W","W","W","W","W","W","W","W","W","L","L","L","L","L","L","L","L"]
[null,43,0.29616995122866963,"W","W","W","W","W","L","L","L","L","L","L","L","L","L","L","L","L","L","L"]
[null,44,0.93131901391990424,"W","W","W","W","W","W","W","W","W","W","W","W","W","W","W","W","W","W","L"]
[null,45,0.54688073131845594,"W","W","W","W","W","W","W","W","W","W","L","L","L","L","L","L","L","L","L"]
[null,46,0.82164961953775006,"W","W","W","W","W","W","W","W","W","W","W","W","W","W","W","W","L","L","L"]
[null,47,0.26717626051001575,"W","W","W","W","W","L","L","L","L","L","L","L","L","L","L","L","L","L","L"]
[null,48,0.49501597532636377,"W","W","W","W","W","W","W","W","W","L","L","L","L","L","L","L","L","L","L"]
[null,49,0.48113644568832281,"W","W","W","W","W","W","W","W","W","L","L","L","L","L","L","L","L","L","L"]
[null,50,0.69155475418114365,"W","W","W","W","W","W","W","W","W","W","W","W","W","L","L","L","L","L","L"]
[null,51,0.87409903803516342,{"$f":"IF($C70>=D$19, \"W\", \"L\")","v":"W"},"W","W","W","W","W","W","W","W","W",{"$f":"IF($C70>=N$19, \"W\", \"L\")","v":"W"},"W","W","W","W","W","W","L","L"]
[null,52,5.4486079715852176E-2,"W","L","L","L","L","L","L","L","L","L","L","L","L","L","L","L","L","L","L"]
[null,53,3.6710823453064423E-3,"L","L","L","L","L","L","L","L","L","L","L","L","L","L","L","L","L","L","L"]
[null,54,0.14425376885980423,"W","W","L","L","L","L","L","L","L","L","L","L","L","L","L","L","L","L","L"]
[null,55,5.5383482883628377E-2,"W","L","L","L","L","L","L","L","L","L","L","L","L","L","L","L","L","L","L"]
[null,56,0.20988074603674112,"W","W","W","W","L","L","L","L","L","L","L","L","L","L","L","L","L","L","L"]
[null,57,3.2577108143976186E-2,"L","L","L","L","L","L","L","L","L","L","L","L","L","L","L","L","L","L","L"]
[null,58,0.62960598884017982,"W","W","W","W","W","W","W","W","W","W","W","W","L","L","L","L","L","L","L"]
[null,59,0.33323282142056398,"W","W","W","W","W","W","L","L","L","L","L","L","L","L","L","L","L","L","L"]
[null,60,0.20582547441292753,"W","W","W","W","L","L","L","L","L","L","L","L","L","L","L","L","L","L","L"]
[null,61,0.41065424985699073,{"$f":"IF($C80>=D$19, \"W\", \"L\")","v":"W"},"W","W","W","W","W","W","W","L","L",{"$f":"IF($C80>=N$19, \"W\", \"L\")","v":"L"},"L","L","L","L","L","L","L","L"]
[null,62,6.3507081934294218E-3,"L","L","L","L","L","L","L","L","L","L","L","L","L","L","L","L","L","L","L"]
[null,63,0.33500668637864939,"W","W","W","W","W","W","L","L","L","L","L","L","L","L","L","L","L","L","L"]
[null,64,0.65973101237733389,"W","W","W","W","W","W","W","W","W","W","W","W","W","L","L","L","L","L","L"]
[null,65,7.4744993420140959E-2,"W","L","L","L","L","L","L","L","L","L","L","L","L","L","L","L","L","L","L"]
[null,66,0.34982265843384341,"W","W","W","W","W","W","L","L","L","L","L","L","L","L","L","L","L","L","L"]
[null,67,0.32680743154819381,"W","W","W","W","W","W","L","L","L","L","L","L","L","L","L","L","L","L","L"]
[null,68,0.18015922052420275,"W","W","W","L","L","L","L","L","L","L","L","L","L","L","L","L","L","L","L"]
[null,69,0.47823934280116198,"W","W","W","W","W","W","W","W","W","L","L","L","L","L","L","L","L","L","L"]
[null,70,0.90169513122750855,"W","W","W","W","W","W","W","W","W","W","W","W","W","W","W","W","W","W","L"]
[null,71,0.25560614975535523,{"$f":"IF($C90>=D$19, \"W\", \"L\")","v":"W"},"W","W","W","W","L","L","L","L","L",{"$f":"IF($C90>=N$19, \"W\", \"L\")","v":"L"},"L","L","L","L","L","L","L","L"]
[null,72,0.21928923575546999,"W","W","W","W","L","L","L","L","L","L","L","L","L","L","L","L","L","L","L"]
[null,73,0.47483485730560071,"W","W","W","W","W","W","W","W","W","L","L","L","L","L","L","L","L","L","L"]
[null,74,0.5603839115616831,"W","W","W","W","W","W","W","W","W","W","W","L","L","L","L","L","L","L","L"]
[null,75,0.17601197256134948,"W","W","W","L","L","L","L","L","L","L","L","L","L","L","L","L","L","L","L"]
[null,76,0.78983795082584962,"W","W","W","W","W","W","W","W","W","W","W","W","W","W","W","L","L","L","L"]
[null,77,0.44146042663875751,"W","W","W","W","W","W","W","W","L","L","L","L","L","L","L","L","L","L","L"]
[null,78,0.45939800908844275,"W","W","W","W","W","W","W","W","W","L","L","L","L","L","L","L","L","L","L"]
[null,79,0.18423904060165475,"W","W","W","L","L","L","L","L","L","L","L","L","L","L","L","L","L","L","L"]
[null,80,5.9992079398685116E-2,"W","L","L","L","L","L","L","L","L","L","L","L","L","L","L","L","L","L","L"]
[null,81,0.79410037880812201,{"$f":"IF($C100>=D$19, \"W\", \"L\")","v":"W"},"W","W","W","W","W","W","W","W","W",{"$f":"IF($C100>=N$19, \"W\", \"L\")","v":"W"},"W","W","W","W","L","L","L","L"]
[null,82,0.41737176077738081,"W","W","W","W","W","W","W","W","L","L","L","L","L","L","L","L","L","L","L"]
[null,83,0.52994514802162063,"W","W","W","W","W","W","W","W","W","W","L","L","L","L","L","L","L","L","L"]
[null,84,0.17604612511715312,"W","W","W","L","L","L","L","L","L","L","L","L","L","L","L","L","L","L","L"]
[null,85,7.1755465518739125E-2,"W","L","L","L","L","L","L","L","L","L","L","L","L","L","L","L","L","L","L"]
[null,86,0.25787776746849489,"W","W","W","W","W","L","L","L","L","L","L","L","L","L","L","L","L","L","L"]
[null,87,3.668681716465183E-2,"L","L","L","L","L","L","L","L","L","L","L","L","L","L","L","L","L","L","L"]
[null,88,0.20994115251505496,"W","W","W","W","L","L","L","L","L","L","L","L","L","L","L","L","L","L","L"]
[null,89,0.35533693024242874,"W","W","W","W","W","W","W","L","L","L","L","L","L","L","L","L","L","L","L"]
[null,90,0.76590531447102261,"W","W","W","W","W","W","W","W","W","W","W","W","W","W","W","L","L","L","L"]
[null,91,0.58292700730460723,{"$f":"IF($C110>=D$19, \"W\", \"L\")","v":"W"},"W","W","W","W","W","W","W","W","W",{"$f":"IF($C110>=N$19, \"W\", \"L\")","v":"W"},"L","L","L","L","L","L","L","L"]
[null,92,0.5354195292775461,"W","W","W","W","W","W","W","W","W","W","L","L","L","L","L","L","L","L","L"]
[null,93,0.55058738490890979,"W","W","W","W","W","W","W","W","W","W","W","L","L","L","L","L","L","L","L"]
[null,94,0.73949486103140549,"W","W","W","W","W","W","W","W","W","W","W","W","W","W","L","L","L","L","L"]
[null,95,0.59692361153276152,"W","W","W","W","W","W","W","W","W","W","W","L","L","L","L","L","L","L","L"]
[null,96,0.32332758589603305,"W","W","W","W","W","W","L","L","L","L","L","L","L","L","L","L","L","L","L"]
[null,97,{"$f":"RAND()","v":0.23684351893281363},"W","W","W","W","L","L","L","L","L","L","L","L","L","L","L","L","L","L","L"]
[null,98,{"$f":"RAND()","v":9.9044657725235519E-2},"W","L","L","L","L","L","L","L","L","L","L","L","L","L","L","L","L","L","L"]
[null,99,{"$f":"RAND()","v":0.65707369205935207},"W","W","W","W","W","W","W","W","W","W","W","W","W","L","L","L","L","L","L"]
[null,100,{"$f":"RAND()","v":0.11983002448778557},"W","W","L","L","L","L","L","L","L","L","L","L","L","L","L","L","L","L","L"]